librelist archives

« back to archive

Consulta ejemplo clase 22 - maven no encuentra mahout

Consulta ejemplo clase 22 - maven no encuentra mahout

From:
Matias Eduardo Bordone Carranza
Date:
2014-12-01 @ 00:48
Disculpas por molestar de nuevo, hice andar el ejemplo de la clase 20 y
todo bien, ahora intento hacer andar el de la clase 22 y me tira el
siguiente error

hadoopuser@huayra:~/aprendizajengrande22/clase22$ mvn clean install package
assembly:single
...
[ERROR] Failed to execute goal on project clase22: Could not resolve
dependencies for project
net.aprendizajengrande.mahout.clasificacion:clase22:jar:0.0.1-SNAPSHOT: The
following artifacts could not be resolved:
org.apache.mahout:mahout-mrlegacy:jar:1.0-SNAPSHOT,
org.apache.mahout:mahout-examples:jar:1.0-SNAPSHOT: Could not find artifact
org.apache.mahout:mahout-mrlegacy:jar:1.0-SNAPSHOT -> [Help 1]
...

Aunque ya tengo instalado mahout (de hecho ya corrí el ejemplo de la clase
20)

Me fijo si está configurado el home de mahout y sale lo sig.

hadoopuser@huayra:~/aprendizajengrande22/clase22$ $MAHOUT_HOME
bash:
/home/hadoopuser/mahout/aprendizajengrande20/mahout-distribution-1.0-SNAPSHOT:
Es un directorio

puede que esté faltando algo de configurar?

Gracias

Matías

Re: [aprendizajengrande] Consulta ejemplo clase 22 - maven no encuentra mahout

From:
Pablo Duboue
Date:
2014-12-01 @ 00:59
Anda al ditectorio donde tenes mahout desde git en la clase 20 y dale

mvn install

Maven se queja que 1.0-SNAPSHOT no está en ~/.m2

En un rato corrijo el script de la clase 20 para que incluya install en el
comando mvn.

Gracias.

P.

On Sunday, November 30, 2014, Matias Eduardo Bordone Carranza <
mebordone@gmail.com> wrote:

> Disculpas por molestar de nuevo, hice andar el ejemplo de la clase 20 y
> todo bien, ahora intento hacer andar el de la clase 22 y me tira el
> siguiente error
>
> hadoopuser@huayra:~/aprendizajengrande22/clase22$ mvn clean install
> package assembly:single
> ...
> [ERROR] Failed to execute goal on project clase22: Could not resolve
> dependencies for project
> net.aprendizajengrande.mahout.clasificacion:clase22:jar:0.0.1-SNAPSHOT: The
> following artifacts could not be resolved:
> org.apache.mahout:mahout-mrlegacy:jar:1.0-SNAPSHOT,
> org.apache.mahout:mahout-examples:jar:1.0-SNAPSHOT: Could not find artifact
> org.apache.mahout:mahout-mrlegacy:jar:1.0-SNAPSHOT -> [Help 1]
> ...
>
> Aunque ya tengo instalado mahout (de hecho ya corrí el ejemplo de la clase
> 20)
>
> Me fijo si está configurado el home de mahout y sale lo sig.
>
> hadoopuser@huayra:~/aprendizajengrande22/clas e22$ $MAHOUT_HOME
> bash:
> /home/hadoopuser/mahout/aprendizajengrande20/mahout-distribution-1.0-SNAPSHOT:
> Es un directorio
>
> puede que esté faltando algo de configurar?
>
> Gracias
>
> Matías
>

Re: [aprendizajengrande] Consulta ejemplo clase 22 - maven no encuentra mahout

From:
Matias Eduardo Bordone Carranza
Date:
2014-12-01 @ 02:17
según lo sugerido sigo con algunos inconvenientes

hadoopuser@huayra:~/mahout$ mvn install

(despues de un buen rato)

...
[INFO]
------------------------------------------------------------------------
[INFO] Reactor Summary:
[INFO]
[INFO] Mahout Build Tools ................................ SUCCESS [1.837s]
[INFO] Apache Mahout ..................................... SUCCESS [0.491s]
[INFO] Mahout Math ....................................... SUCCESS
[1:29.567s]
[INFO] Mahout MapReduce Legacy ........................... FAILURE
[13:57.635s]
[INFO] Mahout Integration ................................ SKIPPED
[INFO] Mahout Examples ................................... SKIPPED
[INFO] Mahout Release Package ............................ SKIPPED
[INFO] Mahout Math Scala bindings ........................ SKIPPED
[INFO] Mahout Spark bindings ............................. SKIPPED
[INFO] Mahout Spark bindings shell ....................... SKIPPED
[INFO] Mahout H2O backend ................................ SKIPPED
[INFO]
------------------------------------------------------------------------
[INFO] BUILD FAILURE
[INFO]
------------------------------------------------------------------------
[INFO] Total time: 15:29.980s
[INFO] Finished at: Sun Nov 30 23:09:03 ART 2014
[INFO] Final Memory: 34M/440M
[INFO]
------------------------------------------------------------------------
[ERROR] Failed to execute goal
org.apache.maven.plugins:maven-surefire-plugin:2.16:test (default-test) on
project mahout-mrlegacy: There are test failures.
[ERROR]
[ERROR] Please refer to
/home/hadoopuser/mahout/mrlegacy/target/surefire-reports for the individual
test results.
[ERROR] -> [Help 1]
[ERROR]
[ERROR] To see the full stack trace of the errors, re-run Maven with the -e
switch.
[ERROR] Re-run Maven using the -X switch to enable full debug logging.
[ERROR]
[ERROR] For more information about the errors and possible solutions,
please read the following articles:
[ERROR] [Help 1]
http://cwiki.apache.org/confluence/display/MAVEN/MojoFailureException
[ERROR]
[ERROR] After correcting the problems, you can resume the build with the
command
[ERROR]   mvn <goals> -rf :mahout-mrlegacy
...

A lo que pensé que era solo un error en algún test y no necesariamente
indica que no se intaló

Ahora quiero ejecutar el ejemplo de la clase 2

hadoopuser@huayra:~/aprendizajengrande22/clase22$ mvn clean install package
assembly:single
[INFO] Scanning for projects...
[INFO]

[INFO]
------------------------------------------------------------------------
[INFO] Building clase22 0.0.1-SNAPSHOT
[INFO]
------------------------------------------------------------------------
[WARNING] The POM for org.apache.mahout:mahout-mrlegacy:jar:1.0-SNAPSHOT is
missing, no dependency information available
[WARNING] The POM for org.apache.mahout:mahout-examples:jar:1.0-SNAPSHOT is
missing, no dependency information available
[INFO]
------------------------------------------------------------------------
[INFO] BUILD FAILURE
[INFO]
------------------------------------------------------------------------
[INFO] Total time: 2.850s
[INFO] Finished at: Sun Nov 30 23:14:36 ART 2014
[INFO] Final Memory: 6M/76M
[INFO]
------------------------------------------------------------------------
[ERROR] Failed to execute goal on project clase22: Could not resolve
dependencies for project
net.aprendizajengrande.mahout.clasificacion:clase22:jar:0.0.1-SNAPSHOT: The
following artifacts could not be resolved:
org.apache.mahout:mahout-mrlegacy:jar:1.0-SNAPSHOT,
org.apache.mahout:mahout-examples:jar:1.0-SNAPSHOT: Could not find artifact
org.apache.mahout:mahout-mrlegacy:jar:1.0-SNAPSHOT -> [Help 1]
[ERROR]
[ERROR] To see the full stack trace of the errors, re-run Maven with the -e
switch.
[ERROR] Re-run Maven using the -X switch to enable full debug logging.
[ERROR]
[ERROR] For more information about the errors and possible solutions,
please read the following articles:
[ERROR] [Help 1]
http://cwiki.apache.org/confluence/display/MAVEN/DependencyResolutionException


El 30 de noviembre de 2014, 9:59 p. m., Pablo Duboue<pablo.duboue@gmail.com>
escribió:

> Anda al ditectorio donde tenes mahout desde git en la clase 20 y dale
>
> mvn install
>
> Maven se queja que 1.0-SNAPSHOT no está en ~/.m2
>
> En un rato corrijo el script de la clase 20 para que incluya install en el
> comando mvn.
>
> Gracias.
>
> P.
>
> On Sunday, November 30, 2014, Matias Eduardo Bordone Carranza <
> mebordone@gmail.com> wrote:
>
>> Disculpas por molestar de nuevo, hice andar el ejemplo de la clase 20 y
>> todo bien, ahora intento hacer andar el de la clase 22 y me tira el
>> siguiente error
>>
>> hadoopuser@huayra:~/aprendizajengrande22/clase22$ mvn clean install
>> package assembly:single
>> ...
>> [ERROR] Failed to execute goal on project clase22: Could not resolve
>> dependencies for project
>> net.aprendizajengrande.mahout.clasificacion:clase22:jar:0.0.1-SNAPSHOT: The
>> following artifacts could not be resolved:
>> org.apache.mahout:mahout-mrlegacy:jar:1.0-SNAPSHOT,
>> org.apache.mahout:mahout-examples:jar:1.0-SNAPSHOT: Could not find artifact
>> org.apache.mahout:mahout-mrlegacy:jar:1.0-SNAPSHOT -> [Help 1]
>> ...
>>
>> Aunque ya tengo instalado mahout (de hecho ya corrí el ejemplo de la
>> clase 20)
>>
>> Me fijo si está configurado el home de mahout y sale lo sig.
>>
>> hadoopuser@huayra:~/aprendizajengrande22/clas e22$ $MAHOUT_HOME
>> bash:
>> /home/hadoopuser/mahout/aprendizajengrande20/mahout-distribution-1.0-SNAPSHOT:
>> Es un directorio
>>
>> puede que esté faltando algo de configurar?
>>
>> Gracias
>>
>> Matías
>>
>


-- 
    "Si tú tienes una manzana y yo tengo una manzana e intercambiamos
    las manzanas, entonces tanto tú como yo seguiremos teniendo una
    manzana. Pero si tú tienes una idea y yo tengo una idea e
    intercambiamos ideas, entonces ambos tendremos dos ideas."
    George Bernard Shaw

Re: [aprendizajengrande] Consulta ejemplo clase 22 - maven no encuentra mahout

From:
Pablo Duboue
Date:
2014-12-01 @ 02:33
Ah.... agregale install al final de la orden mvn con todos los parámetros
en la clase 20 o fijate en el readme del Git recommender.

P.

On Sunday, November 30, 2014, Matias Eduardo Bordone Carranza <
mebordone@gmail.com> wrote:

> según lo sugerido sigo con algunos inconvenientes
>
> hadoopuser@huayra:~/mahout$ mvn install
>
> (despues de un buen rato)
>
> ...
> [INFO]
> ------------------------------------------------------------------------
> [INFO] Reactor Summary:
> [INFO]
> [INFO] Mahout Build Tools ................................ SUCCESS [1.837s]
> [INFO] Apache Mahout ..................................... SUCCESS [0.491s]
> [INFO] Mahout Math ....................................... SUCCESS
> [1:29.567s]
> [INFO] Mahout MapReduce Legacy ........................... FAILURE
> [13:57.635s]
> [INFO] Mahout Integration ................................ SKIPPED
> [INFO] Mahout Examples ................................... SKIPPED
> [INFO] Mahout Release Package ............................ SKIPPED
> [INFO] Mahout Math Scala bindings .............. .......... SKIPPED
> [INFO] Mahout Spark bindings ............................. SKIPPED
> [INFO] Mahout Spark bindings shell ....................... SKIPPED
> [INFO] Mahout H2O backend ................................ SKIPPED
> [INFO]
> ------------------------------------------------------------------------
> [INFO] BUILD FAILURE
> [INFO]
> ------------------------------------------------------------------------
> [INFO] Total time: 15:29.980s
> [INFO] Finished at: Sun Nov 30 23:09:03 ART 2014
> [INFO] Final Memory: 34M/440M
> [INFO]
> ------------------------------------------------------------------------
> [ERROR] Failed to execute goal
> org.apache.maven.plugins:maven-surefire-plugin:2.16:test (default-test) on
> project mahout-mrlegacy: There are test failures.
> [ERROR]
> [ERROR] Please refer to
> /home/hadoopuser/mahout/mrlegacy/target/surefire-reports for the individual
> test result s.
> [ERROR] -> [Help 1]
> [ERROR]
> [ERROR] To see the full stack trace of the errors, re-run Maven with the
> -e switch.
> [ERROR] Re-run Maven using the -X switch to enable full debug logging.
> [ERROR]
> [ERROR] For more information about the errors and possible solutions,
> please read the following articles:
> [ERROR] [Help 1]
> http://cwiki.apache.org/confluence/display/MAVEN/MojoFailureException
> [ERROR]
> [ERROR] After correcting the problems, you can resume the build with the
> command
> [ERROR]   mvn <goals> -rf :mahout-mrlegacy
> ...
>
> A lo que pensé que era solo un error en algún test y no necesariamente
> indica que no se intaló
>
> Ahora quiero ejecutar el ejemplo de la clase 2
>
> hadoopuser@huayra:~/aprendi zajengrande22/clase22$ mvn clean install
> package assembly:single
> [INFO] Scanning for projects...
> [INFO]
>
> [INFO]
> ------------------------------------------------------------------------
> [INFO] Building clase22 0.0.1-SNAPSHOT
> [INFO]
> ------------------------------------------------------------------------
> [WARNING] The POM for org.apache.mahout:mahout-mrlegacy:jar:1.0-SNAPSHOT
> is missing, no dependency information available
> [WARNING] The POM for org.apache.mahout:mahout-examples:jar:1.0-SNAPSHOT
> is missing, no dependency information available
> [INFO]
> ------------------------------------------------------------------------
> [INFO] BUILD FAILURE
> [INFO]
> ------------------------------------------------------------------------
> [INFO] Total time: 2.850s
> [INFO] Finished at: Sun Nov 30 23:14:36 ART 2014
> [INFO] Final Memory: 6M/76M
> [INFO]
> ------------------------------------------------------------------------
> [ERROR] Failed to execute goal on project clase22: Could not resolve
> dependencies for project
> net.aprendizajengrande.mahout.clasificacion:clase22:jar:0.0.1-SNAPSHOT: The
> following artifacts could not be resolved:
> org.apache.mahout:mahout-mrlegacy:jar:1.0-SNAPSHOT,
> org.apache.mahout:mahout-examples:jar:1.0-SNAPSHOT: Could not find artifact
> org.apache.mahout:mahout-mrlegacy:jar:1.0-SNAPSHOT -> [Help 1]
> [ERROR]
> [ERROR] To see the full stack trace of the errors, re-run Maven with the
> -e switch.
> [ERROR] Re-run Maven using the -X switch to enable full debug logging.
> [ERROR]
> [ERROR] For more information about the errors and possible solutions,
> please read the following articles:
> [ERROR] [Help 1]
> http://cwiki.apache.org/confluence/display/MAVEN/DependencyResolutionException
> 
<http://cwiki.apache.org/confluence/display/MAVEN/De%20pendencyResolutionException>
>
>
> El 30 de noviembre de 2014, 9:59 p. m., Pablo Duboue<
> pablo.duboue@gmail.com
> <javascript:_e(%7B%7D,'cvml','pablo.duboue@gmail.com');>> escribió:
>
>> Anda al ditectorio donde tenes mahout desde git en la clase 20 y dale
>>
>> mvn install
>>
>> Maven se queja que 1.0-SNAPSHOT no está en ~/.m2
>>
>> En un rato corrijo el script de la clase 20 para que incluya install en
>> el comando mvn.
>>
>> Gracias.
>>
>> P.
>>
>> On Sunday, November 30, 2014, Matias Eduardo Bordone Carranza <mebordone@gmail
>> .com <javascript:_e(%7B%7D,'cvml','mebordone@gmail.com');>> wrote:
>>
>>> Disculpas por molestar de nuevo, hice andar el ejemplo de la clase 20 y
>>> todo bien, ahora intento hacer andar el de la clase 22 y me tira el
>>> siguiente error
>>>
>>> hadoopuser@huayra:~/aprendizajengrande22/clase22$ mvn clean install
>>> package assembly:single
>>> ...
>>> [ERROR] Failed to execute goal on project clase22: Could not resolve
>>> dependencies for project
>>> net.aprendizajengrande.mahout.clasificacion:clase22:jar:0.0.1-SNAPSHOT: The
>>> following artifacts could not be resolved:
>>> org.apache.mahout:mahout-mrlegacy:jar:1.0-SNAPSHOT,
>>> org.apache.mahout:mahout-examples:jar:1.0-SNAPSHOT: Could not find artifact
>>> org.apache.mahout:mahout-mrlegacy:jar:1.0-SNAPSHOT -> [Help 1]
>>> ...
>>>
>>> Aunque ya tengo instalado mahout (de hecho ya corrí el ejemplo de la
>>> clase 20)
>>>
>>> Me fijo si está configurado el home de mahout y sale lo sig.
>>>
>>> hadoopuser@huayra:~/aprendizajengrande22/clas e22$ $MAHOUT_HOME
>>> bash:
>>> /home/hadoopuser/mahout/aprendizajengrande20/mahout-distribution-1.0-SNAPSHOT:
>>> Es un directorio
>>>
>>> puede que esté faltando algo de configurar?
>>>
>>> Gracias
>>>
>>> Matías
>>>
>>
>
>
> --
>     "Si tú tienes una manzana y yo tengo una manzana e intercambiamos
>     las manzanas, entonces tanto tú como yo seguiremos teniendo una
>     manzana. Pero si tú tienes una idea y yo tengo una idea e
>     intercambiamos ideas, entonces ambos tendremos dos ideas."
>     George Bernard Shaw
>

Re: [aprendizajengrande] Consulta ejemplo clase 22 - maven no encuentra mahout

From:
Matias Eduardo Bordone Carranza
Date:
2014-12-01 @ 05:04
could not decode message